Target
Thyroid hormone receptor beta
Ligand
BDBM50178970
Substrate
Meas. Tech.
ChEMBL_338350 (CHEMBL865335)
EC50
49±n/a nM
Citation
 Garcia Collazo, AMKoehler, KFGarg, NFärnegårdh, MHusman, BYe, LLjunggren, JMellström, KSandberg, JGrynfarb, MAhola, HMalm, J Thyroid receptor ligands. Part 5: novel bicyclic agonist ligands selective for the thyroid hormone receptor beta. Bioorg Med Chem Lett 16:1240-4 (2006)  
Target
Name:
Thyroid hormone receptor beta
Synonyms:
ERBA2 Nuclear receptor subfamily 1 group A member 2 THR1 c-erbA-2 | c-erbA-beta
Type:
Receptor
Mol. Mass.:
52793.62
Organism:
Homo sapiens (Human)
Description:
Recombinant hThR was obtained from nuclear extracts from SF9 cells infected with baculovirus vectors encoding for ThRbeta 1.
Residue:
461
  
Inhibitor
Name:
BDBM50178970
Synonyms:
6-(4-hydroxy-3-isopropylphenoxy)-5,7-dimethylquinoline-2-carboxylic acid | CHEMBL203555
Type:
Small organic molecule
Emp. Form.:
C21H21NO4
Mol. Mass.:
351.3957
SMILES:
CC(C)c1cc(Oc2c(C)cc3nc(ccc3c2C)C(O)=O)ccc1O
: