Target
Putative sugar transporter
Ligand
BDBM50179096
Substrate
Meas. Tech.
ChEMBL_338364 (CHEMBL866544)
Ki
>500000±n/a nM
Citation
 Fayolle, MIonita, MKrishna, SMorin, CPatel, AP Probing structure/affinity relationships for the Plasmodium falciparum hexose transporter with glucose derivatives. Bioorg Med Chem Lett 16:1267-71 (2006)  
Target
Name:
Putative sugar transporter
Synonyms:
Hexose transporter 1
Type:
PROTEIN
Mol. Mass.:
56427.07
Organism:
Plasmodium falciparum
Description:
ChEMBL_456666
Residue:
504
  
Inhibitor
Name:
BDBM50179096
Synonyms:
(3R,4S,5R,6R)-6-(hydroxymethyl)-4-(octadecyloxy)-tetrahydro-2H-pyran-2,3,5-triol | CHEMBL377704
Type:
Small organic molecule
Emp. Form.:
C24H48O6
Mol. Mass.:
432.6343
SMILES:
CCCCCCCCCCCCCCCCCCO[C@@H]1[C@@H](O)C(O)O[C@H](CO)[C@H]1O
: