Target
Peroxisome proliferator-activated receptor delta
Ligand
BDBM50179225
Substrate
Meas. Tech.
ChEMBL_325382 (CHEMBL861062)
EC50
320±n/a nM
Citation
 Mahindroo, NHuang, CFPeng, YHWang, CCLiao, CCLien, TWChittimalla, SKHuang, WJChai, CHPrakash, EChen, CPHsu, TAPeng, CHLu, ILLee, LHChang, YWChen, WCChou, YCChen, CTGoparaju, CMChen, YSLan, SJYu, MCChen, XChao, YSWu, SYHsieh, HP Novel indole-based peroxisome proliferator-activated receptor agonists: design, SAR, structural biology, and biological activities. J Med Chem 48:8194-208 (2005)  
Target
Name:
Peroxisome proliferator-activated receptor delta
Synonyms:
NR1C2 NUCI Nuclear receptor subfamily 1 group C member 2 PPAR-beta PPARD Peroxisome proliferator-activated receptor Peroxisome proliferator-activated receptor delta
Type:
Enzyme
Mol. Mass.:
49910.45
Organism:
Homo sapiens (Human)
Description:
Q03181
Residue:
441
  
Inhibitor
Name:
BDBM50179225
Synonyms:
2-{4-[3-(3-phenyl-7-propylbenzo[d]isoxazol-6-yloxy)propoxy]-indol-1-yl}ethanoic acid | CHEMBL197496
Type:
Small organic molecule
Emp. Form.:
C29H28N2O5
Mol. Mass.:
484.543
SMILES:
CCCc1c(OCCCOc2cccc3n(CC(O)=O)ccc23)ccc2c(noc12)-c1ccccc1
: