Target
Tissue alpha-L-fucosidase
Ligand
BDBM50179481
Substrate
Meas. Tech.
ChEMBL_335897 (CHEMBL859282)
Ki
1±n/a nM
Citation
 Dubernet, MDefoin, ATarnus, C Asymmetric synthesis of the L-fuco-nojirimycin, a nanomolar alpha-L-fucosidase inhibitor. Bioorg Med Chem Lett 16:1172-4 (2006)  
Target
Name:
Tissue alpha-L-fucosidase
Synonyms:
Alpha-L-fucosidase 1 FUCO_BOVIN
Type:
PROTEIN
Mol. Mass.:
54093.12
Organism:
Bos taurus
Description:
ChEMBL_335897
Residue:
468
  
Inhibitor
Name:
BDBM50179481
Synonyms:
CHEMBL203969 | L-fuco-nojirimycin
Type:
Small organic molecule
Emp. Form.:
C6H13NO4
Mol. Mass.:
163.1717
SMILES:
C[C@@H]1NC(O)[C@@H](O)[C@H](O)[C@@H]1O
: