Target
Metabotropic glutamate receptor 5
Ligand
BDBM50179641
Substrate
Meas. Tech.
ChEMBL_335664 (CHEMBL860564)
IC50
620±n/a nM
Citation
 Wållberg, ANilsson, KOsterlund, KPeterson, AElg, SRaboisson, PBauer, UHammerland, LGMattsson, JP Phenyl ureas of creatinine as mGluR5 antagonists. A structure-activity relationship study of fenobam analogues. Bioorg Med Chem Lett 16:1142-5 (2006)  
Target
Name:
Metabotropic glutamate receptor 5
Synonyms:
GPRC1E GRM5_HUMAN metabotropic glutamate 5 | metabotropic glutamate 5a
Type:
Enzyme
Mol. Mass.:
132484.72
Organism:
Homo sapiens (Human)
Description:
Residue:
1212
  
Inhibitor
Name:
BDBM50179641
Synonyms:
1-(3-chlorophenyl)-3-(1-methylpyrrolidin-2-ylidene)urea | CHEMBL380626
Type:
Small organic molecule
Emp. Form.:
C12H14ClN3O
Mol. Mass.:
251.712
SMILES:
CN1CCCC1=NC(=O)Nc1cccc(Cl)c1
: