Target
Oxysterols receptor LXR-alpha
Ligand
BDBM50179860
Substrate
Meas. Tech.
ChEMBL_340909 (CHEMBL860635)
EC50
8±n/a nM
Citation
 Li, LLiu, JZhu, LCutler, SHasegawa, HShan, BMedina, JC Discovery and optimization of a novel series of liver X receptor-alpha agonists. Bioorg Med Chem Lett 16:1638-42 (2006)  
Target
Name:
Oxysterols receptor LXR-alpha
Synonyms:
LXRA Liver X receptor alpha Liver X receptor alpha (NR1H3) NR1H3 Nuclear orphan receptor LXR-alpha | Nuclear receptor subfamily 1 group H member 3
Type:
Enzyme Catalytic Domain
Mol. Mass.:
50403.85
Organism:
Homo sapiens (Human)
Description:
Q13133
Residue:
447
  
Inhibitor
Name:
BDBM50179860
Synonyms:
CHEMBL206738 | N-cyclopentyl-N-(4-(1,1,1,3,3,3-hexafluoro-2-hydroxypropan-2-yl)phenyl)benzenesulfonamide
Type:
Small organic molecule
Emp. Form.:
C20H19F6NO3S
Mol. Mass.:
467.425
SMILES:
OC(c1ccc(cc1)N(C1CCCC1)S(=O)(=O)c1ccccc1)(C(F)(F)F)C(F)(F)F
: