Target
Oxysterols receptor LXR-alpha
Ligand
BDBM50179877
Substrate
Meas. Tech.
ChEMBL_340909 (CHEMBL860635)
EC50
30±n/a nM
Citation
 Li, LLiu, JZhu, LCutler, SHasegawa, HShan, BMedina, JC Discovery and optimization of a novel series of liver X receptor-alpha agonists. Bioorg Med Chem Lett 16:1638-42 (2006)  
Target
Name:
Oxysterols receptor LXR-alpha
Synonyms:
LXRA Liver X receptor alpha Liver X receptor alpha (NR1H3) NR1H3 Nuclear orphan receptor LXR-alpha | Nuclear receptor subfamily 1 group H member 3
Type:
Enzyme Catalytic Domain
Mol. Mass.:
50403.85
Organism:
Homo sapiens (Human)
Description:
Q13133
Residue:
447
  
Inhibitor
Name:
BDBM50179877
Synonyms:
1,1,1,3,3,3-hexafluoro-2-(1-(phenylsulfonyl)-1,2,3,4-tetrahydroquinolin-6-yl)propan-2-ol | CHEMBL381478
Type:
Small organic molecule
Emp. Form.:
C18H15F6NO3S
Mol. Mass.:
439.372
SMILES:
OC(c1ccc2N(CCCc2c1)S(=O)(=O)c1ccccc1)(C(F)(F)F)C(F)(F)F
: