Target
Excitatory amino acid transporter 3
Ligand
BDBM50180145
Substrate
Meas. Tech.
ChEMBL_329872 (CHEMBL870602)
Ki
46000±n/a nM
Citation
 Bunch, LNielsen, BJensen, AABräuner-Osborne, H Rational design and enantioselective synthesis of (1R,4S,5R,6S)-3-azabicyclo[3.3.0]octane-4,6-dicarboxylic acid - a novel inhibitor at human glutamate transporter subtypes 1, 2, and 3. J Med Chem 49:172-8 (2006)  
Target
Name:
Excitatory amino acid transporter 3
Synonyms:
EAA3_HUMAN EAAT3 HEAAC1 | SLC1A1
Type:
Enzyme Catalytic Domain
Mol. Mass.:
57096.71
Organism:
Homo sapiens (Human)
Description:
Excitatory Amino Acid EAAT3 0 HUMAN::P43005
Residue:
524
  
Inhibitor
Name:
BDBM50180145
Synonyms:
(1R,4S,5R,6S)-3-azabicyclo[3.3.0]octane-4,6-dicarboxylic acid | CHEMBL371301
Type:
Small organic molecule
Emp. Form.:
C9H13NO4
Mol. Mass.:
199.2038
SMILES:
OC(=O)[C@H]1CC[C@H]2CN[C@@H]([C@@H]12)C(O)=O
: