Target
5-hydroxytryptamine receptor 7
Ligand
BDBM50180251
Substrate
Meas. Tech.
ChEMBL_329336 (CHEMBL863559)
EC50
5600±n/a nM
Citation
 May, JADantanarayana, APZinke, PWMcLaughlin, MASharif, NA 1-((S)-2-aminopropyl)-1H-indazol-6-ol: a potent peripherally acting 5-HT2 receptor agonist with ocular hypotensive activity. J Med Chem 49:318-28 (2006)  
Target
Name:
5-hydroxytryptamine receptor 7
Synonyms:
5-HT-7 5-HT7 5-HT7S 5HT7 HTR7 | Serotonin receptor 7
Type:
G Protein-Coupled Receptor (GPCR)
Mol. Mass.:
53573.08
Organism:
Homo sapiens (Human)
Description:
P34969
Residue:
479
  
Inhibitor
Name:
BDBM50180251
Synonyms:
1-((S)-2-aminopropyl)-1H-indazol-6-ol | CHEMBL371300
Type:
Small organic molecule
Emp. Form.:
C10H13N3O
Mol. Mass.:
191.2297
SMILES:
C[C@H](N)Cn1ncc2ccc(O)cc12
: