Target
5-hydroxytryptamine receptor 2C
Ligand
BDBM50180255
Substrate
Meas. Tech.
ChEMBL_329321 (CHEMBL863544)
Ki
1.2±n/a nM
Citation
 May, JADantanarayana, APZinke, PWMcLaughlin, MASharif, NA 1-((S)-2-aminopropyl)-1H-indazol-6-ol: a potent peripherally acting 5-HT2 receptor agonist with ocular hypotensive activity. J Med Chem 49:318-28 (2006)  
Target
Name:
5-hydroxytryptamine receptor 2C
Synonyms:
5-HT-2C 5-HT2C-INI 5-HTR2C 5-hydroxytryptamine receptor 2C (5-HT-2C) 5HT-1C HTR1C Serotonin (5-HT3) receptor Serotonin Receptor 2C
Type:
G Protein-Coupled Receptor (GPCR)
Mol. Mass.:
51836.79
Organism:
Homo sapiens (Human)
Description:
P28335
Residue:
458
  
Inhibitor
Name:
BDBM50180255
Synonyms:
1-((S)-2-aminopropyl)-7-chloro-1H-indazol-6-ol | CHEMBL373245
Type:
Small organic molecule
Emp. Form.:
C10H12ClN3O
Mol. Mass.:
225.675
SMILES:
C[C@H](N)Cn1ncc2ccc(O)c(Cl)c12
: