Target
Heat shock protein HSP 90-beta
Ligand
BDBM50180306
Substrate
Meas. Tech.
ChEMBL_329521 (CHEMBL859805)
EC50
38.8±n/a nM
Citation
 He, HZatorska, DKim, JAguirre, JLlauger, LShe, YWu, NImmormino, RMGewirth, DTChiosis, G Identification of potent water soluble purine-scaffold inhibitors of the heat shock protein 90. J Med Chem 49:381-90 (2006)  
Target
Name:
Heat shock protein HSP 90-beta
Synonyms:
HS90B_HUMAN HSP 90 HSP90B HSPCB Heat shock protein HSP 90 (Hsp90)
Type:
Molecular Chaperone
Mol. Mass.:
83229.45
Organism:
Homo sapiens (Human)
Description:
P08238
Residue:
724
  
Inhibitor
Name:
BDBM50180306
Synonyms:
8-(6-BROMO-BENZO[1,3]DIOXOL-5-YLSULFANYL)-9-(3-ISOPROPYLAMINO-PROPYL)-ADENINE CHEMBL383189 US10676476, Example 5
Type:
Small organic molecule
Emp. Form.:
C18H21BrN6O2S
Mol. Mass.:
465.367
SMILES:
CC(C)NCCCn1c(Sc2cc3OCOc3cc2Br)nc2c(N)ncnc12
: