Target
Phospholipase B
Ligand
BDBM50180986
Substrate
Meas. Tech.
ChEMBL_330127 (CHEMBL858987)
IC50
10000±n/a nM
Citation
 Ng, CKObando, DWidmer, FWright, LCSorrell, TCJolliffe, KA Correlation of antifungal activity with fungal phospholipase inhibition using a series of bisquaternary ammonium salts. J Med Chem 49:811-6 (2006)  
Target
Name:
Phospholipase B
Synonyms:
PLB PLB1_CRYNB
Type:
PROTEIN
Mol. Mass.:
68557.23
Organism:
Cryptococcus neoformans
Description:
ChEMBL_330127
Residue:
637
  
Inhibitor
Name:
BDBM50180986
Synonyms:
1,12-Bis(tributyl ammonium)dodecane dichloride | CHEMBL381029
Type:
Small organic molecule
Emp. Form.:
C36H78N2
Mol. Mass.:
539.0168
SMILES:
CCCC[N+](CCCC)(CCCC)CCCCCCCCCCCC[N+](CCCC)(CCCC)CCCC
: