Target
Phospholipase B
Ligand
BDBM50180988
Substrate
Meas. Tech.
ChEMBL_330127 (CHEMBL858987)
IC50
>250000±n/a nM
Citation
 Ng, CKObando, DWidmer, FWright, LCSorrell, TCJolliffe, KA Correlation of antifungal activity with fungal phospholipase inhibition using a series of bisquaternary ammonium salts. J Med Chem 49:811-6 (2006)  
Target
Name:
Phospholipase B
Synonyms:
PLB PLB1_CRYNB
Type:
PROTEIN
Mol. Mass.:
68557.23
Organism:
Cryptococcus neoformans
Description:
ChEMBL_330127
Residue:
637
  
Inhibitor
Name:
BDBM50180988
Synonyms:
1,12-Bis(N-quinuclidlinium)dodecane dibromide | CHEMBL202868
Type:
Small organic molecule
Emp. Form.:
C26H50N2
Mol. Mass.:
390.6875
SMILES:
C(CCCCCC[N+]12CCC(CC1)CC2)CCCCC[N+]12CCC(CC1)CC2
: