Target
Muscarinic acetylcholine receptor M3
Ligand
BDBM50181116
Substrate
Meas. Tech.
ChEMBL_345379 (CHEMBL861122)
Ki
79±n/a nM
Citation
 Provins, LChristophe, BDanhaive, PDulieu, JDurieu, VGillard, MLebon, FLengelé, SQuéré, Lvan Keulen, B First dual M3 antagonists-PDE4 inhibitors: synthesis and SAR of 4,6-diaminopyrimidine derivatives. Bioorg Med Chem Lett 16:1834-9 (2006)  
Target
Name:
Muscarinic acetylcholine receptor M3
Synonyms:
ACM3_HUMAN Cholinergic, muscarinic M3 Muscarinic receptor M3 | RecName: Full=Muscarinic acetylcholine receptor M3
Type:
Enzyme
Mol. Mass.:
66151.03
Organism:
Homo sapiens (Human)
Description:
P20309
Residue:
590
  
Inhibitor
Name:
BDBM50181116
Synonyms:
CHEMBL380477 | N4,2-dicyclopropyl-5-methyl-N6-(2-(thiophen-2-yl)ethyl)pyrimidine-4,6-diamine
Type:
Small organic molecule
Emp. Form.:
C17H22N4S
Mol. Mass.:
314.448
SMILES:
Cc1c(NCCc2cccs2)nc(nc1NC1CC1)C1CC1
: