Target
Platelet-derived growth factor receptor beta
Ligand
BDBM50181320
Substrate
Meas. Tech.
ChEMBL_347373 (CHEMBL865653)
IC50
27±n/a nM
Citation
 Frazier, KJazan, EMcBride, CMPecchi, SRenhowe, PAShafer, CMTaylor, CBussiere, DHe, MMJansen, JMLapointe, GMa, SVora, JWiesmann, M Design and structure-activity relationship of heterocyclic analogs of 4-amino-3-benzimidazol-2-ylhydroquinolin-2-ones as inhibitors of receptor tyrosine kinases. Bioorg Med Chem Lett 16:2247-51 (2006)  
Target
Name:
Platelet-derived growth factor receptor beta
Synonyms:
2.7.10.1 Beta-type platelet-derived growth factor receptor CD140b antigen PDGF-R-beta PDGFR-beta Pdgfr Pdgfrb Platelet-derived growth factor receptor | Platelet-derived growth factor receptor 1
Type:
Enzyme
Mol. Mass.:
122771.00
Organism:
Mus musculus (mouse)
Description:
P05622
Residue:
1098
  
Inhibitor
Name:
BDBM50181320
Synonyms:
4-Amino-3-[6-(4-methylpiperazinyl)benzimidazol-2-yl]hydroquinolin-2-one CHEMBL204427
Type:
Small organic molecule
Emp. Form.:
C21H22N6O
Mol. Mass.:
374.439
SMILES:
CN1CCN(CC1)c1ccc2nc([nH]c2c1)-c1c(N)c2ccccc2[nH]c1=O
: