Target
ALK tyrosine kinase receptor
Ligand
BDBM50181669
Substrate
Meas. Tech.
ChEMBL_331449 (CHEMBL867052)
Ki
500±n/a nM
Citation
 Li, RXue, LZhu, TJiang, QCui, XYan, ZMcGee, DWang, JGantla, VRPickens, JCMcGrath, DChucholowski, AMorris, SWWebb, TR Design and synthesis of 5-aryl-pyridone-carboxamides as inhibitors of anaplastic lymphoma kinase. J Med Chem 49:1006-15 (2006)  
Target
Name:
ALK tyrosine kinase receptor
Synonyms:
ALK ALK_HUMAN CD_antigen: CD246
Type:
Protein
Mol. Mass.:
176453.10
Organism:
Homo sapiens (Human)
Description:
Q9UM73
Residue:
1620
  
Inhibitor
Name:
BDBM50181669
Synonyms:
5-benzo[1,3]dioxol-5-yl-2-oxo-1,2-dihydro-pyridine-3-carboxylic acid [4-(4-methyl-piperazin-1-ylmethyl)-phenyl]-amide | CHEMBL370800
Type:
Small organic molecule
Emp. Form.:
C25H26N4O4
Mol. Mass.:
446.4983
SMILES:
CN1CCN(Cc2ccc(NC(=O)c3cc(c[nH]c3=O)-c3ccc4OCOc4c3)cc2)CC1
: