Target
Insulin receptor
Ligand
BDBM50181674
Substrate
Meas. Tech.
ChEMBL_331450 (CHEMBL867053)
IC50
13800±n/a nM
Citation
 Li, RXue, LZhu, TJiang, QCui, XYan, ZMcGee, DWang, JGantla, VRPickens, JCMcGrath, DChucholowski, AMorris, SWWebb, TR Design and synthesis of 5-aryl-pyridone-carboxamides as inhibitors of anaplastic lymphoma kinase. J Med Chem 49:1006-15 (2006)  
Target
Name:
Insulin receptor
Synonyms:
INSR INSR_HUMAN Insulin receptor beta subunit
Type:
Receptor Tyrosine Kinase
Mol. Mass.:
156322.60
Organism:
Homo sapiens (Human)
Description:
P06213
Residue:
1382
  
Inhibitor
Name:
BDBM50181674
Synonyms:
6'-methoxy-6-oxo-1,6-dihydro-[3,3']bipyridinyl-5-carboxylic acid [4-(4-methyl-piperazin-1-ylmethyl)-phenyl]-amide | CHEMBL203354
Type:
Small organic molecule
Emp. Form.:
C24H27N5O3
Mol. Mass.:
433.5029
SMILES:
COc1ccc(cn1)-c1c[nH]c(=O)c(c1)C(=O)Nc1ccc(CN2CCN(C)CC2)cc1
: