Target
Bcl-2-like protein 1
Ligand
BDBM50181873
Substrate
Meas. Tech.
ChEMBL_332730 (CHEMBL859054)
Ki
652±n/a nM
Citation
 Wendt, MDShen, WKunzer, AMcClellan, WJBruncko, MOost, TKDing, HJoseph, MKZhang, HNimmer, PMNg, SCShoemaker, ARPetros, AMOleksijew, AMarsh, KBauch, JOltersdorf, TBelli, BAMartineau, DFesik, SWRosenberg, SHElmore, SW Discovery and structure-activity relationship of antagonists of B-cell lymphoma 2 family proteins with chemopotentiation activity in vitro and in vivo. J Med Chem 49:1165-81 (2006)  
Target
Name:
Bcl-2-like protein 1
Synonyms:
Anti-apoptotic Bcl-2 protein Apoptosis regulator Bcl-X BCL2-like 1 isoform 1 BCL2L1 Bcl-2-like protein 1 (Bcl-XL) Bcl-xL/Bcl-2-binding component 3 Bcl2-antagonist of cell death (BAD)
Type:
Mitochondrion membrane; Single-pass membrane protein
Mol. Mass.:
26039.60
Organism:
Homo sapiens (Human)
Description:
Residue:
233
  
Inhibitor
Name:
BDBM50181873
Synonyms:
CHEMBL383229 | N-[4-(4,4-dimethylpiperidin-1-yl)benzoyl]-3-nitro-4-(2-phenylsulfanylethylamino)benzenesulfonamide
Type:
Small organic molecule
Emp. Form.:
C28H32N4O5S2
Mol. Mass.:
568.707
SMILES:
CC1(C)CCN(CC1)c1ccc(cc1)C(=O)NS(=O)(=O)c1ccc(NCCSc2ccccc2)c(c1)[N+]([O-])=O
: