Target
Focal adhesion kinase 1
Ligand
BDBM50182008
Substrate
Meas. Tech.
ChEMBL_347197 (CHEMBL865637)
IC50
>10000±n/a nM
Citation
 Choi, HSWang, ZRichmond, WHe, XYang, KJiang, TSim, TKaranewsky, DGu, XJZhou, VLiu, YOhmori, OCaldwell, JGray, NHe, Y Design and synthesis of 7H-pyrrolo[2,3-d]pyrimidines as focal adhesion kinase inhibitors. Part 1. Bioorg Med Chem Lett 16:2173-6 (2006)  
Target
Name:
Focal adhesion kinase 1
Synonyms:
FADK 1 FAK1 FLT4 Focal adhesion kinase (FAK) Focal adhesion kinase 1 (FAK) Focal adhesion kinase-related nonkinase PTK2 Protein-tyrosine kinase 2 p125FAK | pp125FAK
Type:
Tyrosine-protein kinase
Mol. Mass.:
119233.17
Organism:
Homo sapiens (Human)
Description:
Q05397
Residue:
1052
  
Inhibitor
Name:
BDBM50182008
Synonyms:
CHEMBL203675 | N-(5-bromo-2-methylphenyl)-7-(pyridin-2-yl)-7H-pyrrolo[2,3-d]pyrimidin-2-amine
Type:
Small organic molecule
Emp. Form.:
C18H14BrN5
Mol. Mass.:
380.241
SMILES:
Cc1ccc(Br)cc1Nc1ncc2ccn(-c3ccccn3)c2n1
: