Target
Thioredoxin reductase
Ligand
BDBM50182128
Substrate
Meas. Tech.
ChEMBL_347992 (CHEMBL869609)
Ki
1000±n/a nM
Citation
 Andricopulo, ADAkoachere, MBKrogh, RNickel, CMcLeish, MJKenyon, GLArscott, LDWilliams, CHDavioud-Charvet, EBecker, K Specific inhibitors of Plasmodium falciparum thioredoxin reductase as potential antimalarial agents. Bioorg Med Chem Lett 16:2283-92 (2006)  
Target
Name:
Thioredoxin reductase
Synonyms:
TRXR Thioredoxin reductase 2
Type:
PROTEIN
Mol. Mass.:
68716.44
Organism:
Plasmodium falciparum (isolate 3D7)
Description:
ChEMBL_347983
Residue:
617
  
Inhibitor
Name:
BDBM50182128
Synonyms:
4-nitrobenzo[c][1,2,5]thiadiazole | CHEMBL383084
Type:
Small organic molecule
Emp. Form.:
C6H3N3O2S
Mol. Mass.:
181.172
SMILES:
[O-][N+](=O)c1cccc2nsnc12
: