Target
B1 bradykinin receptor
Ligand
BDBM50182244
Substrate
Meas. Tech.
ChEMBL_344574 (CHEMBL868440)
IC50
>40000±n/a nM
Citation
 Fotsch, CBiddlecome, GBiswas, KChen, JJD'Amico, DCGroneberg, RDHan, NBHsieh, FYKamassah, AKumar, GLester-Zeiner, DLiu, QMareska, DARiahi, BBWang, YJYang, KZhan, JZhu, JJohnson, ENg, GAskew, BC A new class of bradykinin 1 receptor antagonists containing the piperidine acetic acid tetralin core. Bioorg Med Chem Lett 16:2071-5 (2006)  
Target
Name:
B1 bradykinin receptor
Synonyms:
B1 BRADYKININ B1R BK-1 receptor BRADYB1 | Bradykinin B1 receptor
Type:
Enzyme
Mol. Mass.:
40508.87
Organism:
Homo sapiens (Human)
Description:
P46663
Residue:
353
  
Inhibitor
Name:
BDBM50182244
Synonyms:
CHEMBL206246 | N-((R)-6-((tert-butylamino)methyl)-1,2,3,4-tetrahydronaphthalen-1-yl)-2-((S)-1-(1-methyl-1H-imidazol-4-ylsulfonyl)piperidin-2-yl)acetamide
Type:
Small organic molecule
Emp. Form.:
C26H39N5O3S
Mol. Mass.:
501.685
SMILES:
Cn1cnc(c1)S(=O)(=O)N1CCCC[C@H]1CC(=O)N[C@@H]1CCCc2cc(CNC(C)(C)C)ccc12
: