Target
Polyunsaturated fatty acid 5-lipoxygenase
Ligand
BDBM50182298
Substrate
Meas. Tech.
ChEMBL_351708 (CHEMBL870097)
IC50
300±n/a nM
Citation
 Grimm, ELBrideau, CChauret, NChan, CCDelorme, DDucharme, YEthier, DFalgueyret, JPFriesen, RWGuay, JHamel, PRiendeau, DSoucy-Breau, CTagari, PGirard, Y Substituted coumarins as potent 5-lipoxygenase inhibitors. Bioorg Med Chem Lett 16:2528-31 (2006)  
Target
Name:
Polyunsaturated fatty acid 5-lipoxygenase
Synonyms:
5-LO 5-Lipoxygenase (5-LO) 5-Lipoygenase ALOX5 LOG5 | LOX5_HUMAN
Type:
Enzyme
Mol. Mass.:
77972.74
Organism:
Homo sapiens (Human)
Description:
Recombinant protein was purified from E. coli lysate. After ammonium sulfate precipitation and subsequent steps, the supernatant (S100) was used for 5-LO activity assay.
Residue:
674
  
Inhibitor
Name:
BDBM50182298
Synonyms:
7-((3-fluoro-5-((1S,3S,5R)-3-hydroxy-6,8-dioxa-bicyclo[3.2.1]octan-3-yl)phenoxy)methyl)-4-phenyl-2H-chromen-2-one | CHEMBL204781
Type:
Small organic molecule
Emp. Form.:
C28H23FO6
Mol. Mass.:
474.477
SMILES:
O[C@]1(C[C@H]2CO[C@@H](C1)O2)c1cc(F)cc(OCc2ccc3c(cc(=O)oc3c2)-c2ccccc2)c1
: