Target
Polyunsaturated fatty acid 5-lipoxygenase
Ligand
BDBM50410894
Substrate
Meas. Tech.
ChEMBL_351709 (CHEMBL870098)
IC50
17000±n/a nM
Citation
 Grimm, ELBrideau, CChauret, NChan, CCDelorme, DDucharme, YEthier, DFalgueyret, JPFriesen, RWGuay, JHamel, PRiendeau, DSoucy-Breau, CTagari, PGirard, Y Substituted coumarins as potent 5-lipoxygenase inhibitors. Bioorg Med Chem Lett 16:2528-31 (2006)  
Target
Name:
Polyunsaturated fatty acid 5-lipoxygenase
Synonyms:
5-LO 5-Lipoxygenase (5-LO) 5-Lipoygenase ALOX5 LOG5 | LOX5_HUMAN
Type:
Enzyme
Mol. Mass.:
77972.74
Organism:
Homo sapiens (Human)
Description:
Recombinant protein was purified from E. coli lysate. After ammonium sulfate precipitation and subsequent steps, the supernatant (S100) was used for 5-LO activity assay.
Residue:
674
  
Inhibitor
Name:
BDBM50410894
Synonyms:
CHEMBL380473
Type:
Small organic molecule
Emp. Form.:
C24H12F8O4S
Mol. Mass.:
548.403
SMILES:
OC(c1cc(F)cc(Sc2ccc(\C(=C/C([O-])=O)c3ccc(F)cc3)c([O-])c2)c1)(C(F)(F)F)C(F)(F)F
: