Target
Potassium voltage-gated channel subfamily A member 3
Ligand
BDBM50182619
Substrate
Meas. Tech.
ChEMBL_334895 (CHEMBL861270)
EC50
2000±n/a nM
Citation
 Harvey, AJBaell, JBToovey, NHomerick, DWulff, H A new class of blockers of the voltage-gated potassium channel Kv1.3 via modification of the 4- or 7-position of khellinone. J Med Chem 49:1433-41 (2006)  
Target
Name:
Potassium voltage-gated channel subfamily A member 3
Synonyms:
KCNA3_MOUSE MK3 Voltage-gated potassium channel subunit Kv1.3
Type:
PROTEIN
Mol. Mass.:
58553.58
Organism:
Mus musculus
Description:
ChEMBL_1513943
Residue:
528
  
Inhibitor
Name:
BDBM50182619
Synonyms:
1-{6-hydroxy-7-methoxy-4-[(2-methylbenzyl)oxy]-1-benzofuran-5-yl}ethanone | CHEMBL204803
Type:
Small organic molecule
Emp. Form.:
C19H18O5
Mol. Mass.:
326.3432
SMILES:
COc1c(O)c(C(C)=O)c(OCc2ccccc2C)c2ccoc12
: