Target
Potassium voltage-gated channel subfamily A member 2
Ligand
BDBM50182597
Substrate
Meas. Tech.
ChEMBL_334898 (CHEMBL861276)
EC50
10000±n/a nM
Citation
 Harvey, AJBaell, JBToovey, NHomerick, DWulff, H A new class of blockers of the voltage-gated potassium channel Kv1.3 via modification of the 4- or 7-position of khellinone. J Med Chem 49:1433-41 (2006)  
Target
Name:
Potassium voltage-gated channel subfamily A member 2
Synonyms:
HBK5 KCNA2 NGK1 Voltage-gated potassium channel | Voltage-gated potassium channel subunit Kv1.2
Type:
PROTEIN
Mol. Mass.:
56695.97
Organism:
Homo sapiens (Human)
Description:
ChEMBL_334898
Residue:
499
  
Inhibitor
Name:
BDBM50182597
Synonyms:
5-acetyl-4,7-benzyloxy-6-hydroxybenzofuran | CHEMBL203909
Type:
Small organic molecule
Emp. Form.:
C24H20O5
Mol. Mass.:
388.4126
SMILES:
CC(=O)c1c(O)c(OCc2ccccc2)c2occc2c1OCc1ccccc1
: