Target
Delta-type opioid receptor
Ligand
BDBM50182940
Substrate
Meas. Tech.
ChEMBL_349385 (CHEMBL863860)
Ki
342±n/a nM
Citation
 Breslin, HJCai, CMiskowski, TACoutinho, SVZhang, SPHornby, PHe, W Identification of potent phenyl imidazoles as opioid receptor agonists. Bioorg Med Chem Lett 16:2505-8 (2006)  
Target
Name:
Delta-type opioid receptor
Synonyms:
Cytochrome P450 3A4 Delta opioid receptor Delta-type opioid receptor (DOR) OPRD_RAT Opioid receptor Opioid receptors; mu & delta Ror-a | Voltage-gated potassium channel
Type:
G Protein-Coupled Receptor (GPCR)
Mol. Mass.:
40465.04
Organism:
Rattus norvegicus (rat)
Description:
Competition binding assays were using CHO-K1 cell membranes expressing the opioid receptor.
Residue:
372
  
Inhibitor
Name:
BDBM50182940
Synonyms:
CHEMBL205273 | N-(4-((S)-2-amino-3-oxo-3-((S)-3-(4-phenyl-1H-imidazol-2-yl)-3,4-dihydroisoquinolin-2(1H)-yl)propyl)phenyl)methanesulfonamide
Type:
Small organic molecule
Emp. Form.:
C28H29N5O3S
Mol. Mass.:
515.627
SMILES:
CS(=O)(=O)Nc1ccc(C[C@H](N)C(=O)N2Cc3ccccc3C[C@H]2c2nc(c[nH]2)-c2ccccc2)cc1
: