Target
Delta-type opioid receptor
Ligand
BDBM50182939
Substrate
Meas. Tech.
ChEMBL_349388 (CHEMBL865695)
EC50
37±n/a nM
Citation
 Breslin, HJCai, CMiskowski, TACoutinho, SVZhang, SPHornby, PHe, W Identification of potent phenyl imidazoles as opioid receptor agonists. Bioorg Med Chem Lett 16:2505-8 (2006)  
Target
Name:
Delta-type opioid receptor
Synonyms:
DOR-1 MSL-2 OPRD_MOUSE Oprd1
Type:
Enzyme Catalytic Domain
Mol. Mass.:
40577.25
Organism:
MOUSE
Description:
P32300
Residue:
372
  
Inhibitor
Name:
BDBM50182939
Synonyms:
(S)-2-amino-3-(4-hydroxy-2,6-dimethylphenyl)-1-((S)-2-(4-phenyl-1H-imidazol-2-yl)piperidin-1-yl)propan-1-one | CHEMBL377069
Type:
Small organic molecule
Emp. Form.:
C25H30N4O2
Mol. Mass.:
418.5313
SMILES:
Cc1cc(O)cc(C)c1C[C@H](N)C(=O)N1CCCC[C@H]1c1nc(c[nH]1)-c1ccccc1
: