Target
Delta-type opioid receptor
Ligand
BDBM50182943
Substrate
Meas. Tech.
ChEMBL_349385 (CHEMBL863860)
Ki
0.06±n/a nM
Citation
 Breslin, HJCai, CMiskowski, TACoutinho, SVZhang, SPHornby, PHe, W Identification of potent phenyl imidazoles as opioid receptor agonists. Bioorg Med Chem Lett 16:2505-8 (2006)  
Target
Name:
Delta-type opioid receptor
Synonyms:
Cytochrome P450 3A4 Delta opioid receptor Delta-type opioid receptor (DOR) OPRD_RAT Opioid receptor Opioid receptors; mu & delta Ror-a | Voltage-gated potassium channel
Type:
G Protein-Coupled Receptor (GPCR)
Mol. Mass.:
40465.04
Organism:
Rattus norvegicus (rat)
Description:
Competition binding assays were using CHO-K1 cell membranes expressing the opioid receptor.
Residue:
372
  
Inhibitor
Name:
BDBM50182943
Synonyms:
4-((S)-2-amino-3-oxo-3-((S)-3-(4-phenyl-1H-imidazol-2-yl)-3,4-dihydroisoquinolin-2(1H)-yl)propyl)-3,5-dimethylbenzamide | CHEMBL427214
Type:
Small organic molecule
Emp. Form.:
C30H31N5O2
Mol. Mass.:
493.5994
SMILES:
Cc1cc(cc(C)c1C[C@H](N)C(=O)N1Cc2ccccc2C[C@H]1c1nc(c[nH]1)-c1ccccc1)C(N)=O
: