Target
Delta-type opioid receptor
Ligand
BDBM50182948
Substrate
Meas. Tech.
ChEMBL_349385 (CHEMBL863860)
Ki
752±n/a nM
Citation
 Breslin, HJCai, CMiskowski, TACoutinho, SVZhang, SPHornby, PHe, W Identification of potent phenyl imidazoles as opioid receptor agonists. Bioorg Med Chem Lett 16:2505-8 (2006)  
Target
Name:
Delta-type opioid receptor
Synonyms:
Cytochrome P450 3A4 Delta opioid receptor Delta-type opioid receptor (DOR) OPRD_RAT Opioid receptor Opioid receptors; mu & delta Ror-a | Voltage-gated potassium channel
Type:
G Protein-Coupled Receptor (GPCR)
Mol. Mass.:
40465.04
Organism:
Rattus norvegicus (rat)
Description:
Competition binding assays were using CHO-K1 cell membranes expressing the opioid receptor.
Residue:
372
  
Inhibitor
Name:
BDBM50182948
Synonyms:
4-((S)-2-amino-3-((S)-3-(5-methyl-4-phenyl-1H-imidazol-2-yl)-3,4-dihydroisoquinolin-2(1H)-yl)-3-oxopropyl)benzonitrile | CHEMBL205329
Type:
Small organic molecule
Emp. Form.:
C29H27N5O
Mol. Mass.:
461.5576
SMILES:
Cc1[nH]c(nc1-c1ccccc1)[C@@H]1Cc2ccccc2CN1C(=O)[C@@H](N)Cc1ccc(cc1)C#N
: