Target
Delta-type opioid receptor
Ligand
BDBM50154041
Substrate
Meas. Tech.
ChEMBL_349385 (CHEMBL863860)
Ki
22±n/a nM
Citation
 Breslin, HJCai, CMiskowski, TACoutinho, SVZhang, SPHornby, PHe, W Identification of potent phenyl imidazoles as opioid receptor agonists. Bioorg Med Chem Lett 16:2505-8 (2006)  
Target
Name:
Delta-type opioid receptor
Synonyms:
Cytochrome P450 3A4 Delta opioid receptor Delta-type opioid receptor (DOR) OPRD_RAT Opioid receptor Opioid receptors; mu & delta Ror-a | Voltage-gated potassium channel
Type:
G Protein-Coupled Receptor (GPCR)
Mol. Mass.:
40465.04
Organism:
Rattus norvegicus (rat)
Description:
Competition binding assays were using CHO-K1 cell membranes expressing the opioid receptor.
Residue:
372
  
Inhibitor
Name:
BDBM50154041
Synonyms:
(S)-2-amino-3-(4-hydroxyphenyl)-1-((S)-2-(5-methyl-4-phenyl-1H-imidazol-2-yl)piperidin-1-yl)propan-1-one CHEMBL366311
Type:
Small organic molecule
Emp. Form.:
C24H28N4O2
Mol. Mass.:
404.5047
SMILES:
Cc1[nH]c(nc1-c1ccccc1)[C@@H]1CCCCN1C(=O)[C@@H](N)Cc1ccc(O)cc1
: