Target
Mu-type opioid receptor
Ligand
BDBM50182938
Substrate
Meas. Tech.
ChEMBL_349386 (CHEMBL863863)
Ki
857±n/a nM
Citation
 Breslin, HJCai, CMiskowski, TACoutinho, SVZhang, SPHornby, PHe, W Identification of potent phenyl imidazoles as opioid receptor agonists. Bioorg Med Chem Lett 16:2505-8 (2006)  
Target
Name:
Mu-type opioid receptor
Synonyms:
MOR-1 Mu-type opioid receptor (MOR) OPRM_RAT Opioid receptor B Ror-b
Type:
G Protein-Coupled Receptor (GPCR)
Mol. Mass.:
44503.11
Organism:
Rattus norvegicus (rat)
Description:
Competition binding assays were carried out using membrane preparations from transfected HN9.10 cells that constitutively expressed the mu opioid receptor.
Residue:
398
  
Inhibitor
Name:
BDBM50182938
Synonyms:
(S)-2-amino-3-(4-aminophenyl)-1-((S)-3-(5-methyl-4-phenyl-1H-imidazol-2-yl)-3,4-dihydroisoquinolin-2(1H)-yl)propan-1-one | CHEMBL208400
Type:
Small organic molecule
Emp. Form.:
C28H29N5O
Mol. Mass.:
451.5628
SMILES:
Cc1[nH]c(nc1-c1ccccc1)[C@@H]1Cc2ccccc2CN1C(=O)[C@@H](N)Cc1ccc(N)cc1
: