Target
Cytochrome P450 2J2
Ligand
BDBM50183079
Substrate
Meas. Tech.
ChEMBL_350781 (CHEMBL869679)
Ki
160±n/a nM
Citation
 Lafite, PDijols, SBuisson, DMacherey, ACZeldin, DCDansette, PMMansuy, D Design and synthesis of selective, high-affinity inhibitors of human cytochrome P450 2J2. Bioorg Med Chem Lett 16:2777-80 (2006)  
Target
Name:
Cytochrome P450 2J2
Synonyms:
CP2J2_HUMAN | CYP2J2
Type:
Enzyme
Mol. Mass.:
57623.04
Organism:
Homo sapiens (Human)
Description:
P51589
Residue:
502
  
Inhibitor
Name:
BDBM50183079
Synonyms:
4-(4-(hydroxydiphenylmethyl)piperidin-1-yl)-1-(4-propylphenyl)butan-1-one | CHEMBL208528
Type:
Small organic molecule
Emp. Form.:
C31H37NO2
Mol. Mass.:
455.631
SMILES:
CCCc1ccc(cc1)C(=O)CCCN1CCC(CC1)C(O)(c1ccccc1)c1ccccc1
: