Target
Integrase
Ligand
BDBM50183475
Substrate
Meas. Tech.
ChEMBL_337041 (CHEMBL862554)
IC50
18000±n/a nM
Citation
 Deng, JSanchez, TNeamati, NBriggs, JM Dynamic pharmacophore model optimization: identification of novel HIV-1 integrase inhibitors. J Med Chem 49:1684-92 (2006)  
Target
Name:
Integrase
Synonyms:
Human immunodeficiency virus type 1 integrase
Type:
PROTEIN
Mol. Mass.:
32231.48
Organism:
Human immunodeficiency virus 1
Description:
ChEMBL_90865
Residue:
288
  
Inhibitor
Name:
BDBM50183475
Synonyms:
5-(3-Amino-propylamino)-7,10-dihydroxy-2-[2-(2-hydroxy-ethylamino)-ethyl]-2H-dibenzo[cd,g]indazol-6-one Piroxantrone hydrochloride
Type:
Small organic molecule
Emp. Form.:
C21H25N5O4
Mol. Mass.:
411.4543
SMILES:
NCCCNc1ccc2n(CCNCCO)nc3-c4c(O)ccc(O)c4C(=O)c1c23
: