Target
Integrin alpha-V/beta-3
Ligand
BDBM50183594
Substrate
Meas. Tech.
ChEMBL_335363 (CHEMBL867620)
IC50
36.3±n/a nM
Citation
 Dal Pozzo, ANi, MMuzi, Lde Castiglione, RMondelli, RMazzini, SPenco, SPisano, CCastorina, MGiannini, G Incorporation of the unusual C(alpha)-fluoroalkylamino acids into cyclopeptides: synthesis of arginine-glycine-aspartate (RGD) analogues and study of their conformational and biological behavior. J Med Chem 49:1808-17 (2006)  
Target
Name:
Integrin alpha-V/beta-3
Synonyms:
ITGAV/ITGB3 | Integrin beta-3/Vitronectin receptor alpha
Type:
Enzyme
Mol. Mass.:
Description:
Components:
This complex has 2 components.
Component 1
Name:
Integrin alpha-V
Synonyms:
ITAV_HUMAN Integrin alpha-V/alpha-5 VNRA Vitronectin receptor | Vitronectin receptor subunit alpha
Type:
PROTEIN
Mol. Mass.:
116024.92
Organism:
Homo sapiens (Human)
Description:
ChEMBL_582336
Residue:
1048
  
Component 2
Name:
Integrin beta-3
Synonyms:
CD_antigen=CD61 GPIIIa ITGB3 Platelet membrane glycoprotein IIIa
Type:
Protein
Mol. Mass.:
87038.91
Organism:
Homo sapiens (Human)
Description:
P05106
Residue:
788
  
Inhibitor
Name:
BDBM50183594
Synonyms:
CHEMBL203693 | c[RGDf-(S)-alpha-TfmV]
Type:
Small organic molecule
Emp. Form.:
C27H37F3N8O7
Mol. Mass.:
642.6273
SMILES:
[#6]-[#6](-[#6])[C@@]1([#7]-[#6](=O)-[#6@@H](-[#6]-c2ccccc2)-[#7]-[#6](=O)-[#6@H](-[#6]-[#6](-[#8])=O)-[#7]-[#6](=O)-[#6]-[#7]-[#6](=O)-[#6@H](-[#6]-[#6]-[#6]\[#7]=[#6](\[#7])-[#7])-[#7]-[#6]1=O)C(F)(F)F
: