Target
Alpha-1D adrenergic receptor
Ligand
BDBM56339
Substrate
Meas. Tech.
ChEMBL_350832 (CHEMBL869686)
EC50
790±n/a nM
Citation
 del Olmo, EBarboza, BYbarra, MILópez-Pérez, JLCarrón, RSevilla, MABoselli, CSan Feliciano, A Vasorelaxant activity of phthalazinones and related compounds. Bioorg Med Chem Lett 16:2786-90 (2006)  
Target
Name:
Alpha-1D adrenergic receptor
Synonyms:
ADA1D_RAT Adra1d Alpha-1D adrenergic receptor | Serotonin 1a (5-HT1a) receptor/Adrenergic receptor alpha-1
Type:
Protein
Mol. Mass.:
59375.97
Organism:
Rattus norvegicus (Rat)
Description:
P23944
Residue:
561
  
Inhibitor
Name:
BDBM56339
Synonyms:
4-(4-chlorobenzyl)-1(2H)-phthalazinone 4-[(4-chlorophenyl)methyl]-2H-phthalazin-1-one MLS000547504 cid_104452
Type:
Small organic molecule
Emp. Form.:
C15H11ClN2O
Mol. Mass.:
270.714
SMILES:
Clc1ccc(Cc2n[nH]c(=O)c3ccccc23)cc1
: