Target
Interstitial collagenase
Ligand
BDBM50183713
Substrate
Meas. Tech.
ChEMBL_354459 (CHEMBL870684)
Ki
>4949±n/a nM
Citation
 Gilmore, JLKing, BWHarris, CMaduskuie, TMercer, SELiu, RQCovington, MBQian, MRibadeneria, MDVaddi, KTrzaskos, JMNewton, RCDecicco, CPDuan, JJ Synthesis and structure-activity relationship of a novel, achiral series of TNF-alpha converting enzyme inhibitors. Bioorg Med Chem Lett 16:2699-704 (2006)  
Target
Name:
Interstitial collagenase
Synonyms:
CLG MMP1 Matrix metalloproteinase-1 | Matrix metalloproteinase-1 (MMP-1)
Type:
Enzyme
Mol. Mass.:
54010.26
Organism:
Homo sapiens (Human)
Description:
P03956
Residue:
469
  
Inhibitor
Name:
BDBM50183713
Synonyms:
CHEMBL208172 | N-(1-(2-(ethylsulfonyl)ethyl)-4-(2-(hydroxyamino)-2-oxoethyl)piperidin-4-yl)-4-((2-methylquinolin-4-yl)methoxy)benzamide
Type:
Small organic molecule
Emp. Form.:
C29H36N4O6S
Mol. Mass.:
568.684
SMILES:
CCS(=O)(=O)CCN1CCC(CC(=O)NO)(CC1)NC(=O)c1ccc(OCc2cc(C)nc3ccccc23)cc1
: