Target
Disintegrin and metalloproteinase domain-containing protein 17
Ligand
BDBM30344
Substrate
Meas. Tech.
ChEMBL_354054 (CHEMBL870008)
Ki
230±n/a nM
Citation
 Janser, PNeumann, UMiltz, WFeifel, RBuhl, T A cassette-dosing approach for improvement of oral bioavailability of dual TACE/MMP inhibitors. Bioorg Med Chem Lett 16:2632-6 (2006)  
Target
Name:
Disintegrin and metalloproteinase domain-containing protein 17
Synonyms:
ADA17_HUMAN CSVP Disintegrin and metalloproteinase domain-containing protein 17 (ADAM17) TNF-alpha convertase TNF-alpha-converting enzyme (TACE) Tumor necrosis factor-α converting enzyme (TACE)
Type:
Enzyme
Mol. Mass.:
93007.89
Organism:
Homo sapiens (Human)
Description:
Residue:
824
  
Inhibitor
Name:
BDBM30344
Synonyms:
Cipemastat | Trocade
Type:
Small organic molecule
Emp. Form.:
C22H36N4O5
Mol. Mass.:
436.545
SMILES:
CN1C(=O)N(C[C@@H]([C@@H](CC2CCCC2)C(=O)N2CCCCC2)C(=O)NO)C(=O)C1(C)C
: