Target
Protein kinase C alpha type
Ligand
BDBM50107120
Substrate
Meas. Tech.
ChEMBL_338717 (CHEMBL860607)
Ki
4.5±n/a nM
Citation
 Lee, JKang, JHHan, KCKim, YKim, SYYoun, HSMook-Jung, IKim, HLo Han, JHHa, HJKim, YHMarquez, VELewin, NEPearce, LVLundberg, DJBlumberg, PM Branched diacylglycerol-lactones as potent protein kinase C ligands and alpha-secretase activators. J Med Chem 49:2028-36 (2006)  
Target
Name:
Protein kinase C alpha type
Synonyms:
KPCA_HUMAN PKC alpha and beta-2 PKC-alpha PRKACA Protein Kinase C- alpha Protein kinase C alpha (PKCa) Protein kinase C alpha type (PRKCA) RAF proto-oncogene serine/threonine-protein kinase
Type:
Enzyme
Mol. Mass.:
76755.65
Organism:
Homo sapiens (Human)
Description:
The recombinant human PKC enzymes were produced using a baculovirus expression system in SF9 cells
Residue:
672
  
Inhibitor
Name:
BDBM50107120
Synonyms:
(E) 2,2-Dimethyl-propionic acid 2-hydroxymethyl-4-(3-isobutyl-5-methyl-hexylidene)-5-oxo-tetrahydro-furan-2-ylmethyl ester 2,2-Dimethyl-propionic acid 2-hydroxymethyl-4-(3-isobutyl-5-methyl-hexylidene)-5-oxo-tetrahydro-furan-2-ylmethyl ester CHEMBL137386
Type:
Small organic molecule
Emp. Form.:
C22H38O5
Mol. Mass.:
382.5341
SMILES:
CC(C)CC(C\C=C1/CC(CO)(COC(=O)C(C)(C)C)OC1=O)CC(C)C
: