Target
Peroxisome proliferator-activated receptor delta
Ligand
BDBM50184666
Substrate
Meas. Tech.
ChEMBL_355606 (CHEMBL853178)
EC50
970±n/a nM
Citation
 Epple, RAzimioara, MRusso, RBursulaya, BTian, SSGerken, AIskandar, M 1,3,5-Trisubstituted aryls as highly selective PPARdelta agonists. Bioorg Med Chem Lett 16:2969-73 (2006)  
Target
Name:
Peroxisome proliferator-activated receptor delta
Synonyms:
NR1C2 NUCI Nuclear receptor subfamily 1 group C member 2 PPAR-beta PPARD Peroxisome proliferator-activated receptor Peroxisome proliferator-activated receptor delta
Type:
Enzyme
Mol. Mass.:
49910.45
Organism:
Homo sapiens (Human)
Description:
Q03181
Residue:
441
  
Inhibitor
Name:
BDBM50184666
Synonyms:
CHEMBL379123 | [4-([1,1';3',1'']terphenyl-5'-ylmet hoxy)-phenoxy]-acetic acid
Type:
Small organic molecule
Emp. Form.:
C27H22O4
Mol. Mass.:
410.4612
SMILES:
OC(=O)COc1ccc(OCc2cc(cc(c2)-c2ccccc2)-c2ccccc2)cc1
: