Target
Transient receptor potential cation channel subfamily V member 1
Ligand
BDBM29080
Substrate
Meas. Tech.
ChEMBL_342816 (CHEMBL868829)
EC50
890±n/a nM
Citation
 Appendino, GMinassi, ABerton, LMoriello, ASCascio, MGDe Petrocellis, LDi Marzo, V Oxyhomologues of anandamide and related endolipids: chemoselective synthesis and biological activity. J Med Chem 49:2333-8 (2006)  
Target
Name:
Transient receptor potential cation channel subfamily V member 1
Synonyms:
Capsaicin receptor Osm-9-like TRP channel 1 TRPV1_HUMAN Transient receptor potential cation channel subfamily V member 1 (TRPV1) Transient receptor potential cation channel subfamily V member 1(TRPV1) Vanilloid VR1 Vanilloid receptor 1 Vanilloid receptor 1 (VRI/TRPV1)
Type:
Protein
Mol. Mass.:
94960.75
Organism:
Homo sapiens (Human)
Description:
Q8NER1
Residue:
839
  
Inhibitor
Name:
BDBM29080
Synonyms:
CHEMBL280065 Oleamide MEA Oleoylethanolamide (OEA)
Type:
Emp. Form.:
C20H39NO2
Mol. Mass.:
325.5292
SMILES:
CCCCCCCC\C=C/CCCCCCCC(=O)NCCO
: