Target
Tyrosine-protein kinase Fgr
Ligand
BDBM4078
Substrate
Meas. Tech.
ChEMBL_343255 (CHEMBL861014)
IC50
9400±n/a nM
Citation
 Cozza, GBonvini, PZorzi, EPoletto, GPagano, MASarno, SDonella-Deana, AZagotto, GRosolen, APinna, LAMeggio, FMoro, S Identification of ellagic acid as potent inhibitor of protein kinase CK2: a successful example of a virtual screening application. J Med Chem 49:2363-6 (2006)  
Target
Name:
Tyrosine-protein kinase Fgr
Synonyms:
FGR_RAT | Fgr
Type:
PROTEIN
Mol. Mass.:
58810.13
Organism:
Rattus norvegicus
Description:
ChEMBL_343255
Residue:
517
  
Inhibitor
Name:
BDBM4078
Synonyms:
6,7,13,14-tetrahydroxy-2,9-dioxatetracyclo[6.6.2.0^{4,16}.0^{11,15}]hexadeca-1(14),4(16),5,7,11(15),12-hexaene-3,10-dione ELLAGIC ACID Ellagic acid (18) MLS000069632 cid_5281855
Type:
Small organic molecule
Emp. Form.:
C14H6O8
Mol. Mass.:
302.1926
SMILES:
Oc1cc2c3c(oc(=O)c4cc(O)c(O)c(oc2=O)c34)c1O
: