Target
Integrin alpha-V/beta-3
Ligand
BDBM50185450
Substrate
Meas. Tech.
ChEMBL_360911 (CHEMBL870872)
IC50
0.21±n/a nM
Citation
 Penning, TDKhilevich, AChen, BBRussell, MABoys, MLWang, YDuffin, TEngleman, VWFinn, MBFreeman, SKHanneke, MLKeene, JLKlover, JANickols, GANickols, MARader, RKSettle, SLShannon, KESteininger, CNWestlin, MMWestlin, WF Synthesis of pyrazoles and isoxazoles as potent alpha(v)beta3 receptor antagonists. Bioorg Med Chem Lett 16:3156-61 (2006)  
Target
Name:
Integrin alpha-V/beta-3
Synonyms:
ITGAV/ITGB3 | Integrin beta-3/Vitronectin receptor alpha
Type:
Enzyme
Mol. Mass.:
Description:
Components:
This complex has 2 components.
Component 1
Name:
Integrin alpha-V
Synonyms:
ITAV_HUMAN Integrin alpha-V/alpha-5 VNRA Vitronectin receptor | Vitronectin receptor subunit alpha
Type:
PROTEIN
Mol. Mass.:
116024.92
Organism:
Homo sapiens (Human)
Description:
ChEMBL_582336
Residue:
1048
  
Component 2
Name:
Integrin beta-3
Synonyms:
CD_antigen=CD61 GPIIIa ITGB3 Platelet membrane glycoprotein IIIa
Type:
Protein
Mol. Mass.:
87038.91
Organism:
Homo sapiens (Human)
Description:
P05106
Residue:
788
  
Inhibitor
Name:
BDBM50185450
Synonyms:
3-(benzo[d][1,3]dioxol-5-yl)-4-(1-methyl-5-(2-(5,6,7,8-tetrahydro-1,8-naphthyridin-2-yl)ethoxy)-1H-pyrazol-3-yl)butanoic acid | CHEMBL208470
Type:
Small organic molecule
Emp. Form.:
C25H28N4O5
Mol. Mass.:
464.5136
SMILES:
Cn1nc(CC(CC(O)=O)c2ccc3OCOc3c2)cc1OCCc1ccc2CCCNc2n1
: