Target
Integrin alpha-V/beta-5
Ligand
BDBM50185470
Substrate
Meas. Tech.
ChEMBL_360912 (CHEMBL870876)
IC50
1.03±n/a nM
Citation
 Penning, TDKhilevich, AChen, BBRussell, MABoys, MLWang, YDuffin, TEngleman, VWFinn, MBFreeman, SKHanneke, MLKeene, JLKlover, JANickols, GANickols, MARader, RKSettle, SLShannon, KESteininger, CNWestlin, MMWestlin, WF Synthesis of pyrazoles and isoxazoles as potent alpha(v)beta3 receptor antagonists. Bioorg Med Chem Lett 16:3156-61 (2006)  
Target
Name:
Integrin alpha-V/beta-5
Synonyms:
ITGAV/ITGB5 | Integrin beta-5/Vitronectin receptor alpha
Type:
Enzyme
Mol. Mass.:
Description:
Components:
This complex has 2 components.
Component 1
Name:
Integrin alpha-V
Synonyms:
ITAV_HUMAN Integrin alpha-V/alpha-5 VNRA Vitronectin receptor | Vitronectin receptor subunit alpha
Type:
PROTEIN
Mol. Mass.:
116024.92
Organism:
Homo sapiens (Human)
Description:
ChEMBL_582336
Residue:
1048
  
Component 2
Name:
Integrin beta-5
Synonyms:
ITB5_HUMAN | ITGB5
Type:
PROTEIN
Mol. Mass.:
88047.37
Organism:
Homo sapiens (Human)
Description:
EBI_10915
Residue:
799
  
Inhibitor
Name:
BDBM50185470
Synonyms:
3-(benzo[d][1,3]dioxol-5-yl)-4-(5-(2-(5,6,7,8-tetrahydro-1,8-naphthyridin-2-yl)ethoxy)-1-(2,2,2-trifluoroethyl)-1H-pyrazol-3-yl)butanoic acid | CHEMBL208813
Type:
Small organic molecule
Emp. Form.:
C26H27F3N4O5
Mol. Mass.:
532.5116
SMILES:
OC(=O)CC(Cc1cc(OCCc2ccc3CCCNc3n2)n(CC(F)(F)F)n1)c1ccc2OCOc2c1
: