Target
Alpha-1A adrenergic receptor
Ligand
BDBM50185473
Substrate
Meas. Tech.
ChEMBL_361007 (CHEMBL862620)
Ki
39±n/a nM
Citation
 Ablordeppey, SYLyles-Eggleston, MBricker, BZhang, WZhu, XGoodman, CRoth, BL Evaluation of the eutomer of 4-{3-(4-chlorophenyl)-3-hydroxypyrrolidin-1-yl}-1-(4-fluorophenyl)butan-1-one, {(+)-SYA 09}, a pyrrolidine analog of haloperidol. Bioorg Med Chem Lett 16:3219-23 (2006)  
Target
Name:
Alpha-1A adrenergic receptor
Synonyms:
ADA1A_HUMAN ADRA1C Alpha 1A-adrenoceptor Alpha adrenergic receptor 1a Alpha-adrenergic receptor 1c adrenergic Alpha1 | adrenergic Alpha1C
Type:
Cell-surface receptors
Mol. Mass.:
51511.67
Organism:
Homo sapiens (Human)
Description:
P35348
Residue:
466
  
Inhibitor
Name:
BDBM50185473
Synonyms:
4-(3-(4-chlorophenyl)-3-hydroxy-8-aza-bicyclo[3.2.1]octan-8-yl)-1-(4-fluorophenyl)butan-1-one 4-[3-(4-Chlorophenyl)-3-hydroxy-8-azabicyclo[3.2.1]oct-8-yl]-1-(4-fluorophenyl)butan-1-one | CHEMBL210578
Type:
Small organic molecule
Emp. Form.:
C23H25ClFNO2
Mol. Mass.:
401.902
SMILES:
OC1(CC2CCC(C1)N2CCCC(=O)c1ccc(F)cc1)c1ccc(Cl)cc1
: