Target
Amyloid-beta precursor protein
Ligand
BDBM50173647
Substrate
Meas. Tech.
ChEMBL_353056 (CHEMBL865747)
Ki
1.2±n/a nM
Citation
 Zhuang, ZPKung, MPKung, HF Synthesis of biphenyltrienes as probes for beta-amyloid plaques. J Med Chem 49:2841-4 (2006)  
Target
Name:
Amyloid-beta precursor protein
Synonyms:
A4 ABPP AICD-50 AICD-59 AID(57) APP Alzheimer disease amyloid protein Amyloid beta Protein Amyloid beta protein Abeta(1-42) Amyloid intracellular domain 57 Amyloid protein (Abeta42b) Beta amyloid A4 protein Beta-APP42 Beta-amyloid protein 42 C83 CVAP Gamma Secretase Gamma-CTF(57) Gamma-secretase Gamma-secretase C-terminal fragment 57 P3(40) PN-II Protease nexin-II S-APP-beta Soluble APP-beta | beta-Amyloid Precursor Protein (APP)
Type:
Single-pass type I membrane protein
Mol. Mass.:
86890.41
Organism:
Homo sapiens (Human)
Description:
P05067
Residue:
770
  
Inhibitor
Name:
BDBM50173647
Synonyms:
(E)-4-(4-(methylamino)styryl)phenol 4-N-methylamino-4'-hydroxystilbene CHEMBL381642 [3H]-4-(4-(methylamino)styryl)phenol
Type:
Small organic molecule
Emp. Form.:
C15H15NO
Mol. Mass.:
225.2857
SMILES:
CNc1ccc(\C=C\c2ccc(O)cc2)cc1
: