Target
Metabotropic glutamate receptor 5
Ligand
BDBM50186320
Substrate
Meas. Tech.
ChEMBL_369768 (CHEMBL865368)
IC50
15000±n/a nM
Citation
 Kulkarni, SSNightingale, BDersch, CMRothman, RBNewman, AH Design and synthesis of noncompetitive metabotropic glutamate receptor subtype 5 antagonists. Bioorg Med Chem Lett 16:3371-5 (2006)  
Target
Name:
Metabotropic glutamate receptor 5
Synonyms:
GPRC1E GRM5_HUMAN metabotropic glutamate 5 | metabotropic glutamate 5a
Type:
Enzyme
Mol. Mass.:
132484.72
Organism:
Homo sapiens (Human)
Description:
Residue:
1212
  
Inhibitor
Name:
BDBM50186320
Synonyms:
3-chloro-N-(4-methylthiazol-2-yl)benzamide | CHEMBL212529
Type:
Small organic molecule
Emp. Form.:
C11H9ClN2OS
Mol. Mass.:
252.72
SMILES:
Cc1csc(NC(=O)c2cccc(Cl)c2)n1
: