Target
Metabotropic glutamate receptor 5
Ligand
BDBM50186331
Substrate
Meas. Tech.
ChEMBL_369768 (CHEMBL865368)
IC50
18300±n/a nM
Citation
 Kulkarni, SSNightingale, BDersch, CMRothman, RBNewman, AH Design and synthesis of noncompetitive metabotropic glutamate receptor subtype 5 antagonists. Bioorg Med Chem Lett 16:3371-5 (2006)  
Target
Name:
Metabotropic glutamate receptor 5
Synonyms:
GPRC1E GRM5_HUMAN metabotropic glutamate 5 | metabotropic glutamate 5a
Type:
Enzyme
Mol. Mass.:
132484.72
Organism:
Homo sapiens (Human)
Description:
Residue:
1212
  
Inhibitor
Name:
BDBM50186331
Synonyms:
CHEMBL377935 biphenyl-3-carboxylic acid (6-methyl-pyridin-2-yl)-amide
Type:
Small organic molecule
Emp. Form.:
C19H16N2O
Mol. Mass.:
288.3431
SMILES:
Cc1cccc(NC(=O)c2cccc(c2)-c2ccccc2)n1
: