Target
Alpha-1D adrenergic receptor
Ligand
BDBM50186603
Substrate
Meas. Tech.
ChEMBL_353199 (CHEMBL865719)
EC50
1500±n/a nM
Citation
 Boschi, DTron, GCLazzarato, LChegaev, KCena, CDi Stilo, AGiorgis, MBertinaria, MFruttero, RGasco, A NO-donor phenols: a new class of products endowed with antioxidant and vasodilator properties. J Med Chem 49:2886-97 (2006)  
Target
Name:
Alpha-1D adrenergic receptor
Synonyms:
ADA1D_RAT Adra1d Alpha-1D adrenergic receptor | Serotonin 1a (5-HT1a) receptor/Adrenergic receptor alpha-1
Type:
Protein
Mol. Mass.:
59375.97
Organism:
Rattus norvegicus (Rat)
Description:
P23944
Residue:
561
  
Inhibitor
Name:
BDBM50186603
Synonyms:
4-((N-((6-hydroxy-2,5,7,8-tetramethylchroman-2-yl)methyl)-N-methylamino)methyl)furoxan-3-carboxamide | CHEMBL380475
Type:
Small organic molecule
Emp. Form.:
C19H26N4O5
Mol. Mass.:
390.4335
SMILES:
CN(Cc1no[n+]([O-])c1C(N)=O)CC1(C)CCc2c(C)c(O)c(C)c(C)c2O1
: