Target
Alpha-1D adrenergic receptor
Ligand
BDBM50156310
Substrate
Meas. Tech.
ChEMBL_353199 (CHEMBL865719)
EC50
12±n/a nM
Citation
 Boschi, DTron, GCLazzarato, LChegaev, KCena, CDi Stilo, AGiorgis, MBertinaria, MFruttero, RGasco, A NO-donor phenols: a new class of products endowed with antioxidant and vasodilator properties. J Med Chem 49:2886-97 (2006)  
Target
Name:
Alpha-1D adrenergic receptor
Synonyms:
ADA1D_RAT Adra1d Alpha-1D adrenergic receptor | Serotonin 1a (5-HT1a) receptor/Adrenergic receptor alpha-1
Type:
Protein
Mol. Mass.:
59375.97
Organism:
Rattus norvegicus (Rat)
Description:
P23944
Residue:
561
  
Inhibitor
Name:
BDBM50156310
Synonyms:
4-(3-(3-benzenesulfonylfuroxan-4-yloxy)propyl)phenol CHEMBL189804
Type:
Small organic molecule
Emp. Form.:
C17H16N2O6S
Mol. Mass.:
376.384
SMILES:
Oc1ccc(CCCOc2no[n+]([O-])c2S(=O)(=O)c2ccccc2)cc1
: