Target
Alpha-1D adrenergic receptor
Ligand
BDBM50156305
Substrate
Meas. Tech.
ChEMBL_353199 (CHEMBL865719)
EC50
1200±n/a nM
Citation
 Boschi, DTron, GCLazzarato, LChegaev, KCena, CDi Stilo, AGiorgis, MBertinaria, MFruttero, RGasco, A NO-donor phenols: a new class of products endowed with antioxidant and vasodilator properties. J Med Chem 49:2886-97 (2006)  
Target
Name:
Alpha-1D adrenergic receptor
Synonyms:
ADA1D_RAT Adra1d Alpha-1D adrenergic receptor | Serotonin 1a (5-HT1a) receptor/Adrenergic receptor alpha-1
Type:
Protein
Mol. Mass.:
59375.97
Organism:
Rattus norvegicus (Rat)
Description:
P23944
Residue:
561
  
Inhibitor
Name:
BDBM50156305
Synonyms:
2,5,7,8-Tetramethyl-2-(3-nitrooxy-propoxymethyl)-chroman-6-ol CHEMBL188200
Type:
Small organic molecule
Emp. Form.:
C17H25NO6
Mol. Mass.:
339.3835
SMILES:
Cc1c(C)c2OC(C)(COCCCO[N+]([O-])=O)CCc2c(C)c1O
: